BDBM50175262 (S)-N-(5-chloro-2-methylphenyl)-2-ethylpiperidine-1-carbothioamide::CHEMBL199490
SMILES CC[C@H]1CCCCN1C(=S)Nc1cc(Cl)ccc1C
InChI Key InChIKey=TZWBKDCHJLQIDG-ZDUSSCGKSA-N
Data  2 EC50
  Tab Delimited (TSV)   2D SDfile   Computed 3D by Vconf -m prep SDfile
Find this compound or compounds like it in BindingDB:
Activity Spreadsheet -- Enzyme Inhibition Constant Data from BindingDB
Found 1 hit for monomerid = 50175262
TargetPeroxisome proliferator-activated receptor alpha(Rattus norvegicus)
Novartis Institutes For Biomedical Research
Curated by ChEMBL
LigandPNGBDBM50175262((S)-N-(5-chloro-2-methylphenyl)-2-ethylpiperidine-...)
Affinity DataEC50: >1.00E+5nM. Assay description: Activity against PPAR-alpha
In DepthDetails ArticlePubMed